{"text_format":"1","workbook":"xlsx","n_sheets":15,"sheets":["Oznámení","Data","List č. 01","List č. 02","List č. 03","List č. 04","List č. 05","List č. 06","List č. 07","List č. 08","List č. 09","List č. 10 - právnická osoba","List č. 10 - fyzická osoba","List č. 10 - jiný zdroj","List č. 11"],"not_rendered":{"charts":0,"images":2,"macros":1,"external_links":0,"defined_names":16,"comments":14,"pivot_tables":0},"unopened":[],"bounds":{"document_bytes":16777216,"sheet_cells":100000,"rows_first":2000,"rows_last":500,"rows_between":2000,"halvings":0,"cell_chars":16384,"cell_head_chars":4096},"cells_cut":0,"cells_raw":0,"read":"whole","date_system":"1900"}

{"sheet":"Oznámení","index":0,"n_rows":352,"n_cols":5,"rows_kept":352,"cut":false,"hidden":false,"merged":[[287,0,287,3],[280,0,280,1],[283,0,283,1],[298,0,349,2],[351,0,352,2],[290,0,297,2],[289,0,289,2],[158,0,158,1],[267,0,267,1],[281,0,281,1],[272,0,273,1],[270,0,270,1],[279,0,279,1],[269,0,269,1],[268,0,268,1],[271,0,271,1],[278,0,278,1],[274,0,274,1],[275,0,275,1],[276,0,276,1],[115,0,115,1],[272,2,273,2],[286,1,286,2],[282,0,282,1],[277,0,277,1],[136,0,136,1],[148,0,148,1],[149,0,149,1],[150,0,151,2],[180,0,180,1],[181,0,181,1],[185,0,185,1],[237,0,237,1],[186,0,187,2],[184,0,184,1],[239,0,239,2],[46,0,46,1],[266,0,266,2],[262,0,263,2],[238,0,238,1],[32,0,32,2],[131,0,135,2],[242,0,244,2],[259,0,259,1],[260,0,260,1],[172,0,174,2],[250,0,250,1],[232,1,232,2],[127,0,127,1],[124,0,124,1],[97,0,97,1],[106,0,106,1],[86,0,86,1],[87,0,87,1],[16,0,16,2],[72,0,72,1],[20,0,20,1],[25,0,25,1],[60,0,60,1],[61,0,61,1],[52,0,53,2],[42,0,43,2],[51,0,51,1],[37,0,38,2],[50,0,50,1],[71,0,71,1],[62,0,63,2],[29,0,29,1],[0,0,0,2],[5,0,5,1],[6,0,6,1],[11,0,11,1],[2,0,2,1],[1,0,1,2],[3,0,3,1],[30,0,30,2],[128,0,128,1],[159,0,159,1],[171,0,171,1],[166,0,166,1],[170,0,170,1],[129,0,130,0],[160,0,161,2],[129,1,130,1],[125,0,125,1],[34,0,35,2],[74,0,75,2],[89,0,90,2],[40,0,40,1],[41,0,41,1],[79,0,79,1]]}
["OZNÁMENÍ O ČINNOSTECH, MAJETKU, PŘÍJMECH A ZÁVAZCÍCH",null,null,null,{"$f":"Data!W2","v":1}]
["Při vyplňování se prosím řiďte Pokyny k vyplnění průběžného oznámení a Metodikou k podávání oznámení veřejnými funkcionáři podle zákona \no střetu zájmů."]
["Všechna pole označena * jsou povinná."]
["Označení � odkazuje na Základní poučení na straně číslo 5 nebo 6."]
[2021]
["Oddíl I."]
["Všeobecné údaje"]
["Jméno*, příjmení*, titul"]
{"$rows_left_out":345}
{"sheet":"Data","index":1,"n_rows":157,"n_cols":28,"rows_kept":157,"cut":false,"hidden":true,"merged":[]}
[null,null,null,null,null,null,null,null,null,null,null,null,null,null,null,null,null,null,null,null,null,null,"hodnoty k přepínačům","buňka"]
["funkce (2)","Podnikání(3)","Člen statutárního orgánu(4)","Společník","Provozování rozhlasu(5)","Provozování rozhlasu(6)","Obdobný vztah(7)","Zaměstnavatel","Nemovité věci 8+9+10","Sloupec1","Sloupec1","1 nemovitosti",null,"Cenné papíry (11)","Cenné papíry 12","Obchodní podíl nepředstavovaný CP(13)","Jiné věci movité (14)","Jiné věci movité (15)","Příjmy","Příjmy","Závazky",null,1,"typ oznámení",null,2018,"1.1.2018—31.12.2018","Obecné poučení"]
["Vyberte funkci","Vyberte způsob podnikání","Vyberte druh orgánu",null,"Vyberte předmět","Vyberte způsob","Vyberte druh činnosti","Vyberte zaměstnavatele","Vyberte druh nemovité věci","Vyberte způsob nabytí","Vyberte typ vlastnictví",{"$f":"IF(Oznámení!$B$138=\"vyberte druh nemovité věci\",\"Vyberte specifikaci druhu\",IF(Oznámení!$B$138=\"pozemek\",M16,IF(Oznámení!$B$138=\"stavba\",M29,IF(Oznámení!$B$138=\"jednotka\",M42,IF(Oznámení!$B$138=\"jiné\",M68,IF(Oznámení!$B$138=\"právo stavby\",M55,\"\"))))))","v":"Vyberte specifikaci druhu"},null,"Vyberte druh","Vyberte typ vlastnictví","Vyberte typ vlastnictví","Vyberte způsob nabytí","Vyberte typ vlastnictví","Vyberte druh příjmu","Vyberte zdroj příjmu","Vyberte věřitele",null,2,"podnikání ",null,2019,"1.1.2019—31.12.2019"]
["Předsedkyně/Předseda","prostřednictvím odpovědného zástupce","dozorčí orgán",null,"provozování rozhlasového vysílání","jako společník, člen nebo ovládající osoba právnické osoby, která je provozovatelem rozhlasového nebo televizního vysílání nebo vydavatelem periodického tisku","pracovněprávní vztah","nepodnikající fyzická osoba","pozemek","darovací smlouva","společné jmění manželů",{"$f":"IF(Oznámení!$B$138=\"vyberte druh nemovité věci\",\"Nezvolili jste druh nemovité věci\",IF(Oznámení!$B$138=\"pozemek\",M17,IF(Oznámení!$B$138=\"stavba\",M30,IF(Oznámení!$B$138=\"jednotka\",M43,IF(Oznámení!$B$138=\"jiné\",M69,IF(Oznámení!$B$138=\"právo stavby\",M56,\"\"))))))","v":"Nezvolili jste druh nemovité věci"},null,"akcie","společné jmění manželů","společné jmění manželů","darovací smlouva","společné jmění manželů","dar","fyzická osoba","Fyzická osoba",null,2,"podnikání listy",null,2020,"1.1.2020—31.12.2020","Uvádějte pouze činnosti, majetek a příjmy, které jste vykonávali resp. nově nabyli za Vámi zadané období, ve kterém jste byli ve výkonu funkce a výši existujících a dosud nesplacených závazků k 31. prosinci daného roku."]
["Místopředsedkyně/Místopředseda","samostatně","kontrolní orgán",null,"provozování televizního vysílání","samostatně","služební poměr","podnikající fyzická osoba nebo právnická osoba","stavba","dědění","spoluvlastnictví",{"$f":"IF(Oznámení!$B$138=\"vyberte druh nemovité věci\",\"\",IF(Oznámení!$B$138=\"pozemek\",M18,IF(Oznámení!$B$138=\"stavba\",M31,IF(Oznámení!$B$138=\"jednotka\",M44,IF(Oznámení!$B$138=\"jiné\",M70,IF(Oznámení!$B$138=\"právo stavby\",M57,\"\"))))))","v":""},null,"dluhopis","spoluvlastnictví","spoluvlastnictví","dědění","spoluvlastnictví","dohoda o pracovní činnosti","právnická osoba","Právnická osoba",null,2,"společník",null,2021,"1.1.2021—31.12.2021","Uvádějte pouze činnosti, majetek a příjmy, které jste vykonávali resp. nově nabyli za rok 2019, ev. část kalendářního roku 2019, ve kterém jste byli ve výkonu funkce a výši existujících a dosud nesplacených závazků k 31. prosinci 2019."]
["Předsedkyně senátu/Předseda senátu",null,"řídící orgán",null,"vydávání periodického tisku",null,"obdobný vztah",null,"jednotka","kupní smlouva","výlučné",{"$f":"IF(Oznámení!$B$138=\"vyberte druh nemovité věci\",\"\",IF(Oznámení!$B$138=\"pozemek\",M19,IF(Oznámení!$B$138=\"stavba\",M32,IF(Oznámení!$B$138=\"jednotka\",M45,IF(Oznámení!$B$138=\"jiné\",M71,IF(Oznámení!$B$138=\"právo stavby\",M58,\"\"))))))","v":""},null,"investiční list","výlučné","výlučné","kupní smlouva","výlučné","dohoda o provedení práce","jiný zdroj",null,null,2,"společník -list",null,2022,"1.1.2022—31.12.2022"]
["Předsedkyně kolegia/Předseda kolegia",null,"statutární orgán",null,null,null,null,null,"právo stavby","odkaz",null,{"$f":"IF(Oznámení!$B$138=\"vyberte druh nemovité věci\",\"\",IF(Oznámení!$B$138=\"pozemek\",M20,IF(Oznámení!$B$138=\"stavba\",M33,IF(Oznámení!$B$138=\"jednotka\",M46,IF(Oznámení!$B$138=\"jiné\",M72,IF(Oznámení!$B$138=\"právo stavby\",M59,\"\"))))))","v":""},null,"kmenový list",null,null,"odkaz",null,"pracovní poměr",null,null,null,2,"člen statut.",null,2023,"1.1.2023—31.12.2023"]
["Soudkyně/Soudce",null,"jiné",null,null,null,null,null,"jiné","směnná smlouva",null,{"$f":"IF(Oznámení!$B$138=\"vyberte druh nemovité věci\",\"\",IF(Oznámení!$B$138=\"pozemek\",M21,IF(Oznámení!$B$138=\"stavba\",M34,IF(Oznámení!$B$138=\"jednotka\",M47,IF(Oznámení!$B$138=\"jiné\",M73,IF(Oznámení!$B$138=\"právo stavby\",M60,\"\"))))))","v":""},null,"podílový list",null,null,"směnná smlouva",null,"příjem z podnikatelské nebo jiné samostatné výdělečné činnosti",null,null,null,2,"člen sta.- list",null,2024,"1.1.2024—31.12.2024"]
{"$rows_left_out":150}
{"sheet":"List č. 01","index":2,"n_rows":84,"n_cols":5,"rows_kept":84,"cut":false,"hidden":false,"merged":[[78,0,78,2],[5,1,5,2],[12,0,12,2],[18,0,18,2],[24,0,24,2],[30,0,30,2],[36,0,36,2],[48,0,48,2],[54,0,54,2],[60,0,60,2],[42,0,42,2],[8,0,9,2],[6,1,6,2],[7,1,7,2],[0,0,0,3],[66,0,66,2],[2,1,2,2],[4,1,4,2],[72,0,72,2]]}
[{"$f":"IF(Data!W2=1,\"Prazdný list netiskněte. Vyplňte pouze v případě, že počet políček v Oznámení nebude dostatečný.\",\"Vytiskněte a vyplňte pouze v případě, že počet políček v Oznámení nebude dostatečný\")","v":"Prazdný list netiskněte. Vyplňte pouze v případě, že počet políček v Oznámení nebude dostatečný."},null,null,null,{"$f":"Data!W2","v":1}]
[]
["OZ 3 - NS/12/2021","List  č. 01 - Podnikání nebo provozování jiné samostatné výdělečné činnosti"]
[null,"List číslo"]
["Jméno, příjmení, datum narození",{"$f":"IF(Oznámení!B8=\"\",\"\",CONCATENATE(Oznámení!B8,\", nar. \",TEXT(Oznámení!B9,\"dd.mm.rrrr\")))","v":""}]
["Organizace",{"$f":"IF(Oznámení!B22=\"\",\"\",Oznámení!B22)","v":""}]
["Typ oznámení",{"$f":"IF(Data!W2=1,\"Průběžné oznámení; řádné\",IF(Data!W2=2,\"Průběžné oznámení; doplnění\",IF(Data!W2=0,\"Průběžné oznámení;       ⃝   řádné              ⃝   doplnění\")))","v":"Průběžné oznámení; řádné"}]
["Období od - do",{"$f":"IF(Oznámení!B34=\"\",CONCATENATE(TEXT(Oznámení!B32,\"dd.mm.rrrr\")),Oznámení!B34)","v":"1.1.2021 - 31.12.2021"}]
{"$rows_left_out":77}
{"sheet":"List č. 02","index":3,"n_rows":84,"n_cols":2,"rows_kept":84,"cut":false,"hidden":false,"merged":[[0,0,0,2],[2,1,2,2],[4,1,4,2],[8,0,9,2],[6,1,6,2],[7,1,7,2],[5,1,5,2]]}
[{"$f":"IF(Data!W2=1,\"Prazdný list netiskněte. Vyplňte pouze v případě, že počet políček v Oznámení nebude dostatečný.\",\"Vytiskněte a vyplňte pouze v případě, že počet políček v Oznámení nebude dostatečný\")","v":"Prazdný list netiskněte. Vyplňte pouze v případě, že počet políček v Oznámení nebude dostatečný."}]
[]
["OZ 3 - NS/12/2021","List č. 02 - Společník nebo člen podnikající právnické osoby"]
[null,"List číslo"]
["Jméno, příjmení, datum narození",{"$f":"IF(Oznámení!B8=\"\",\"\",CONCATENATE(Oznámení!B8,\", nar. \",TEXT(Oznámení!B9,\"dd.mm.rrrr\")))","v":""}]
["Organizace",{"$f":"IF(Oznámení!B22=\"\",\"\",Oznámení!B22)","v":""}]
["Typ oznámení",{"$f":"IF(Data!W2=1,\"Průběžné oznámení; řádné\",IF(Data!W2=2,\"Průběžné oznámení; doplnění\",IF(Data!W2=0,\"Průběžné oznámení;       ⃝   řádné              ⃝   doplnění\")))","v":"Průběžné oznámení; řádné"}]
["Období od - do",{"$f":"IF(Oznámení!B34=\"\",CONCATENATE(TEXT(Oznámení!B32,\"dd.mm.rrrr\")),Oznámení!B34)","v":"1.1.2021 - 31.12.2021"}]
{"$rows_left_out":77}
{"sheet":"List č. 03","index":4,"n_rows":82,"n_cols":5,"rows_kept":82,"cut":false,"hidden":false,"merged":[[0,0,0,2],[8,0,9,2],[4,1,4,2],[6,1,6,2],[7,1,7,2]]}
[{"$f":"IF(Data!W2=1,\"Prazdný list netiskněte. Vyplňte pouze v případě, že počet políček v Oznámení nebude dostatečný.\",\"Vytiskněte a vyplňte pouze v případě, že počet políček v Oznámení nebude dostatečný\")","v":"Prazdný list netiskněte. Vyplňte pouze v případě, že počet políček v Oznámení nebude dostatečný."},null,null,null,{"$f":"Data!W2","v":1}]
[]
["OZ 3 - NS/12/2021                List č. 03 - Člen statutárního orgánu, člen řídícího, dozorčího nebo kontrolního orgánu podnikající právnické osoby"]
[null,"List číslo"]
["Jméno, příjmení, datum narození",{"$f":"IF(Oznámení!B8=\"\",\"\",CONCATENATE(Oznámení!B8,\", nar. \",TEXT(Oznámení!B9,\"dd.mm.rrrr\")))","v":""}]
["Organizace",{"$f":"IF(Oznámení!B22=\"\",\"\",Oznámení!B22)","v":""}]
["Typ oznámení",{"$f":"IF(Data!W2=1,\"Průběžné oznámení; řádné\",IF(Data!W2=2,\"Průběžné oznámení; doplnění\",IF(Data!W2=0,\"Průběžné oznámení;       ⃝   řádné              ⃝   doplnění\")))","v":"Průběžné oznámení; řádné"}]
["Období od - do",{"$f":"IF(Oznámení!B34=\"\",CONCATENATE(TEXT(Oznámení!B32,\"dd.mm.rrrr\")),Oznámení!B34)","v":"1.1.2021 - 31.12.2021"}]
{"$rows_left_out":75}
{"sheet":"List č. 04","index":5,"n_rows":78,"n_cols":5,"rows_kept":78,"cut":false,"hidden":false,"merged":[[68,0,69,1],[57,0,58,1],[35,0,36,1],[24,0,25,1],[13,0,14,1],[46,0,47,1],[0,0,0,2],[2,1,2,2],[4,1,4,2],[8,0,9,2],[6,1,6,2],[7,1,7,2],[5,1,5,2]]}
[{"$f":"IF(Data!W2=1,\"Prazdný list netiskněte. Vyplňte pouze v případě, že počet políček v Oznámení nebude dostatečný.\",\"Vytiskněte a vyplňte pouze v případě, že počet políček v Oznámení nebude dostatečný\")","v":"Prazdný list netiskněte. Vyplňte pouze v případě, že počet políček v Oznámení nebude dostatečný."},null,null,null,{"$f":"Data!$W$2","v":1}]
[]
["OZ 3 - NS/12/2021","List  č. 04 - Provozování rozhlasového nebo televizního vysílání nebo vydávání periodického tisku"]
[null,"List číslo"]
["Jméno, příjmení, datum narození",{"$f":"IF(Oznámení!B8=\"\",\"\",CONCATENATE(Oznámení!B8,\", nar. \",TEXT(Oznámení!B9,\"dd.mm.rrrr\")))","v":""}]
["Organizace",{"$f":"IF(Oznámení!B22=\"\",\"\",Oznámení!B22)","v":""}]
["Typ oznámení",{"$f":"IF(Data!W2=1,\"Průběžné oznámení; řádné\",IF(Data!W2=2,\"Průběžné oznámení; doplnění\",IF(Data!W2=0,\"Průběžné oznámení;       ⃝   řádné              ⃝   doplnění\")))","v":"Průběžné oznámení; řádné"}]
["Období od - do",{"$f":"IF(Oznámení!B34=\"\",CONCATENATE(TEXT(Oznámení!B32,\"dd.mm.rrrr\")),Oznámení!B34)","v":"1.1.2021 - 31.12.2021"}]
{"$rows_left_out":71}
{"sheet":"List č. 05","index":6,"n_rows":83,"n_cols":5,"rows_kept":83,"cut":false,"hidden":false,"merged":[[33,0,33,2],[42,0,42,2],[6,1,6,2],[7,1,7,2],[5,1,5,2],[0,0,0,2],[2,1,2,2],[8,0,9,2],[15,0,15,2],[24,0,24,2],[4,1,4,2]]}
[{"$f":"IF(Data!W2=1,\"Prazdný list netiskněte. Vyplňte pouze v případě, že počet políček v Oznámení nebude dostatečný.\",\"Vytiskněte a vyplňte pouze v případě, že počet políček v Oznámení nebude dostatečný\")","v":"Prazdný list netiskněte. Vyplňte pouze v případě, že počet políček v Oznámení nebude dostatečný."},null,null,null,{"$f":"Data!W2","v":1}]
[]
["OZ 3 - NS/12/2021","List č. 05 - Další činnosti v pracovněprávním nebo obdobném vztahu nebo ve služebním poměru"]
[null,"List číslo"]
["Jméno, příjmení, datum narození",{"$f":"IF(Oznámení!B8=\"\",\"\",CONCATENATE(Oznámení!B8,\", nar. \",TEXT(Oznámení!B9,\"dd.mm.rrrr\")))","v":""}]
["Organizace",{"$f":"IF(Oznámení!B22=\"\",\"\",Oznámení!B22)","v":""}]
["Typ oznámení",{"$f":"IF(Data!W2=1,\"Průběžné oznámení; řádné\",IF(Data!W2=2,\"Průběžné oznámení; doplnění\",IF(Data!W2=0,\"Průběžné oznámení;       ⃝   řádné              ⃝   doplnění\")))","v":"Průběžné oznámení; řádné"}]
["Období od - do",{"$f":"IF(Oznámení!B34=\"\",CONCATENATE(TEXT(Oznámení!B32,\"dd.mm.rrrr\")),Oznámení!B34)","v":"1.1.2021 - 31.12.2021"}]
{"$rows_left_out":76}
{"sheet":"List č. 06","index":7,"n_rows":151,"n_cols":5,"rows_kept":151,"cut":false,"hidden":false,"merged":[[81,0,82,2],[0,0,0,2],[2,1,2,2],[4,1,4,2],[8,0,9,2],[6,1,6,2],[7,1,7,2],[5,1,5,2],[10,0,11,2]]}
[{"$f":"IF(Data!W2=1,\"Prazdný list netiskněte. Vyplňte pouze v případě, že počet políček v Oznámení nebude dostatečný.\",\"Vytiskněte a vyplňte pouze v případě, že počet políček v Oznámení nebude dostatečný\")","v":"Prazdný list netiskněte. Vyplňte pouze v případě, že počet políček v Oznámení nebude dostatečný."},null,null,null,{"$f":"Data!W2","v":1}]
[]
["OZ 3 - NS/12/2021","List č. 06 - Věci nemovité"]
[null,"List číslo"]
["Jméno, příjmení, datum narození",{"$f":"IF(Oznámení!B8=\"\",\"\",CONCATENATE(Oznámení!B8,\", nar. \",TEXT(Oznámení!B9,\"dd.mm.rrrr\")))","v":""}]
["Organizace",{"$f":"IF(Oznámení!B22=\"\",\"\",Oznámení!B22)","v":""}]
["Typ oznámení",{"$f":"IF(Data!W2=1,\"Průběžné oznámení; řádné\",IF(Data!W2=2,\"Průběžné oznámení; doplnění\",IF(Data!W2=0,\"Průběžné oznámení;       ⃝   řádné              ⃝   doplnění\")))","v":"Průběžné oznámení; řádné"}]
["Období od - do",{"$f":"IF(Oznámení!B34=\"\",CONCATENATE(TEXT(Oznámení!B32,\"dd.mm.rrrr\")),Oznámení!B34)","v":"1.1.2021 - 31.12.2021"}]
{"$rows_left_out":144}
{"sheet":"List č. 07","index":8,"n_rows":84,"n_cols":5,"rows_kept":84,"cut":false,"hidden":false,"merged":[[0,0,0,2],[2,1,2,2],[4,1,4,2],[8,0,9,2],[6,1,6,2],[7,1,7,2],[5,1,5,2]]}
[{"$f":"IF(Data!W2=1,\"Prazdný list netiskněte. Vyplňte pouze v případě, že počet políček v Oznámení nebude dostatečný.\",\"Vytiskněte a vyplňte pouze v případě, že počet políček v Oznámení nebude dostatečný\")","v":"Prazdný list netiskněte. Vyplňte pouze v případě, že počet políček v Oznámení nebude dostatečný."},null,null,null,{"$f":"Data!W2","v":1}]
[]
["OZ 3 - NS/12/2021","List č. 07 - Cenné papíry, zaknihované cenné papíry nebo práva s nimi spojená"]
[null,"List číslo"]
["Jméno, příjmení, datum narození",{"$f":"IF(Oznámení!B8=\"\",\"\",CONCATENATE(Oznámení!B8,\", nar. \",TEXT(Oznámení!B9,\"dd.mm.rrrr\")))","v":""}]
["Organizace",{"$f":"IF(Oznámení!B22=\"\",\"\",Oznámení!B22)","v":""}]
["Typ oznámení",{"$f":"IF(Data!W2=1,\"Průběžné oznámení; řádné\",IF(Data!W2=2,\"Průběžné oznámení; doplnění\",IF(Data!W2=0,\"Průběžné oznámení;       ⃝   řádné              ⃝   doplnění\")))","v":"Průběžné oznámení; řádné"}]
["Období od - do",{"$f":"IF(Oznámení!B34=\"\",CONCATENATE(TEXT(Oznámení!B32,\"dd.mm.rrrr\")),Oznámení!B34)","v":"1.1.2021 - 31.12.2021"}]
{"$rows_left_out":77}
{"sheet":"List č. 08","index":9,"n_rows":76,"n_cols":5,"rows_kept":76,"cut":false,"hidden":false,"merged":[[2,0,2,2],[0,0,0,2],[70,0,70,2],[30,0,30,2],[38,0,38,2],[46,0,46,2],[62,0,62,2],[54,0,54,2],[14,0,14,2],[22,0,22,2],[4,1,4,2],[8,0,9,2],[5,1,5,2],[6,1,6,2],[7,1,7,2]]}
[{"$f":"IF(Data!W2=1,\"Prazdný list netiskněte. Vyplňte pouze v případě, že počet políček v Oznámení nebude dostatečný.\",\"Vytiskněte a vyplňte pouze v případě, že počet políček v Oznámení nebude dostatečný\")","v":"Prazdný list netiskněte. Vyplňte pouze v případě, že počet políček v Oznámení nebude dostatečný."},null,null,null,{"$f":"Data!W2","v":1}]
[]
["OZ 3 - NS/12/2021                              List č. 08 - Podíl v obchodní korporaci nepředstavovaný cenným papírem nebo zaknihovaným cenným papírem"]
[null,"List číslo"]
["Jméno, příjmení, datum narození",{"$f":"IF(Oznámení!B8=\"\",\"\",CONCATENATE(Oznámení!B8,\", nar. \",TEXT(Oznámení!B9,\"dd.mm.rrrr\")))","v":""}]
["Organizace",{"$f":"IF(Oznámení!B22=\"\",\"\",Oznámení!B22)","v":""}]
["Typ oznámení",{"$f":"IF(Data!W2=1,\"Průběžné oznámení; řádné\",IF(Data!W2=2,\"Průběžné oznámení; doplnění\",IF(Data!W2=0,\"Průběžné oznámení;       ⃝   řádné              ⃝   doplnění\")))","v":"Průběžné oznámení; řádné"}]
["Období od - do",{"$f":"IF(Oznámení!B34=\"\",CONCATENATE(TEXT(Oznámení!B32,\"dd.mm.rrrr\")),Oznámení!B34)","v":"1.1.2021 - 31.12.2021"}]
{"$rows_left_out":69}
{"sheet":"List č. 09","index":10,"n_rows":83,"n_cols":5,"rows_kept":83,"cut":false,"hidden":false,"merged":[[0,0,0,3],[2,1,2,2],[4,1,4,2],[8,0,10,2],[6,1,6,2],[7,1,7,2],[5,1,5,2]]}
[{"$f":"IF(Data!W2=1,\"Prazdný list netiskněte. Vyplňte pouze v případě, že počet políček v Oznámení nebude dostatečný.\",\"Vytiskněte a vyplňte pouze v případě, že počet políček v Oznámení nebude dostatečný\")","v":"Prazdný list netiskněte. Vyplňte pouze v případě, že počet políček v Oznámení nebude dostatečný."},null,null,null,{"$f":"Data!W2","v":1}]
[]
["OZ 3 - NS/12/2021","List č. 09 - Jiné věci movité"]
[null,"List číslo"]
["Jméno, příjmení, datum narození",{"$f":"IF(Oznámení!B8=\"\",\"\",CONCATENATE(Oznámení!B8,\", nar. \",TEXT(Oznámení!B9,\"dd.mm.rrrr\")))","v":""}]
["Organizace",{"$f":"IF(Oznámení!B22=\"\",\"\",Oznámení!B22)","v":""}]
["Typ oznámení",{"$f":"IF(Data!W2=1,\"Průběžné oznámení; řádné\",IF(Data!W2=2,\"Průběžné oznámení; doplnění\",IF(Data!W2=0,\"Průběžné oznámení;       ⃝   řádné              ⃝   doplnění\")))","v":"Průběžné oznámení; řádné"}]
["Období od - do",{"$f":"IF(Oznámení!B34=\"\",CONCATENATE(TEXT(Oznámení!B32,\"dd.mm.rrrr\")),Oznámení!B34)","v":"1.1.2021 - 31.12.2021"}]
{"$rows_left_out":76}
{"sheet":"List č. 10 - právnická osoba","index":11,"n_rows":161,"n_cols":5,"rows_kept":161,"cut":false,"hidden":false,"merged":[[0,0,0,2],[2,1,2,2],[4,1,4,2],[8,0,9,2],[6,1,6,2],[7,1,7,2],[5,1,5,2]]}
[{"$f":"IF(Data!W2=1,\"Prazdný list netiskněte. Vyplňte pouze v případě, že počet políček v Oznámení nebude dostatečný.\",\"Vytiskněte a vyplňte pouze v případě, že počet políček v Oznámení nebude dostatečný\")","v":"Prazdný list netiskněte. Vyplňte pouze v případě, že počet políček v Oznámení nebude dostatečný."},null,null,null,{"$f":"Data!W2","v":1}]
[]
["OZ 3 - NS/12/2021","List č. 10 - Jakékoliv peněžité příjmy nebo jiné majetkové výhody a dary"]
[null,"List číslo"]
["Jméno, příjmení, datum narození",{"$f":"IF(Oznámení!B8=\"\",\"\",CONCATENATE(Oznámení!B8,\", nar. \",TEXT(Oznámení!B9,\"dd.mm.rrrr\")))","v":""}]
["Organizace",{"$f":"IF(Oznámení!B22=\"\",\"\",Oznámení!B22)","v":""}]
["Typ oznámení",{"$f":"IF(Data!W2=1,\"Průběžné oznámení; řádné\",IF(Data!W2=2,\"Průběžné oznámení; doplnění\",IF(Data!W2=0,\"Průběžné oznámení;       ⃝   řádné              ⃝   doplnění\")))","v":"Průběžné oznámení; řádné"}]
["Období od - do",{"$f":"IF(Oznámení!B34=\"\",CONCATENATE(TEXT(Oznámení!B32,\"dd.mm.rrrr\")),Oznámení!B34)","v":"1.1.2021 - 31.12.2021"}]
{"$rows_left_out":154}
{"sheet":"List č. 10 - fyzická osoba","index":12,"n_rows":83,"n_cols":5,"rows_kept":83,"cut":false,"hidden":false,"merged":[[0,0,0,2],[2,1,2,2],[4,1,4,2],[8,0,9,2],[6,1,6,2],[7,1,7,2],[5,1,5,2]]}
[{"$f":"IF(Data!W2=1,\"Prazdný list netiskněte. Vyplňte pouze v případě, že počet políček v Oznámení nebude dostatečný.\",\"Vytiskněte a vyplňte pouze v případě, že počet políček v Oznámení nebude dostatečný\")","v":"Prazdný list netiskněte. Vyplňte pouze v případě, že počet políček v Oznámení nebude dostatečný."},null,null,null,{"$f":"Data!W2","v":1}]
[]
["OZ 3 - NS/12/2021","List č. 10 - Jakékoliv peněžité příjmy nebo jiné majetkové výhody a dary"]
[null,"List číslo"]
["Jméno, příjmení, datum narození",{"$f":"IF(Oznámení!B8=\"\",\"\",CONCATENATE(Oznámení!B8,\", nar. \",TEXT(Oznámení!B9,\"dd.mm.rrrr\")))","v":""}]
["Organizace",{"$f":"IF(Oznámení!B22=\"\",\"\",Oznámení!B22)","v":""}]
["Typ oznámení",{"$f":"IF(Data!W2=1,\"Průběžné oznámení; řádné\",IF(Data!W2=2,\"Průběžné oznámení; doplnění\",IF(Data!W2=0,\"Průběžné oznámení;       ⃝   řádné              ⃝   doplnění\")))","v":"Průběžné oznámení; řádné"}]
["Období od - do",{"$f":"IF(Oznámení!B34=\"\",CONCATENATE(TEXT(Oznámení!B32,\"dd.mm.rrrr\")),Oznámení!B34)","v":"1.1.2021 - 31.12.2021"}]
{"$rows_left_out":76}
{"sheet":"List č. 10 - jiný zdroj","index":13,"n_rows":85,"n_cols":5,"rows_kept":85,"cut":false,"hidden":false,"merged":[[0,0,0,2],[2,1,2,2],[10,1,10,2],[4,1,4,2],[8,0,9,2],[6,1,6,2],[7,1,7,2],[5,1,5,2]]}
[{"$f":"IF(Data!W2=1,\"Prazdný list netiskněte. Vyplňte pouze v případě, že počet políček v Oznámení nebude dostatečný.\",\"Vytiskněte a vyplňte pouze v případě, že počet políček v Oznámení nebude dostatečný\")","v":"Prazdný list netiskněte. Vyplňte pouze v případě, že počet políček v Oznámení nebude dostatečný."},null,null,null,{"$f":"Data!W2","v":1}]
[]
["OZ 3 - NS/12/2021","List č. 10 - Jakékoliv peněžité příjmy nebo jiné majetkové výhody a dary"]
[null,"List číslo"]
["Jméno, příjmení, datum narození",{"$f":"IF(Oznámení!B8=\"\",\"\",CONCATENATE(Oznámení!B8,\", nar. \",TEXT(Oznámení!B9,\"dd.mm.rrrr\")))","v":""}]
["Organizace",{"$f":"IF(Oznámení!B22=\"\",\"\",Oznámení!B22)","v":""}]
["Typ oznámení",{"$f":"IF(Data!W2=1,\"Průběžné oznámení; řádné\",IF(Data!W2=2,\"Průběžné oznámení; doplnění\",IF(Data!W2=0,\"Průběžné oznámení;       ⃝   řádné              ⃝   doplnění\")))","v":"Průběžné oznámení; řádné"}]
["Období od - do",{"$f":"IF(Oznámení!B34=\"\",CONCATENATE(TEXT(Oznámení!B32,\"dd.mm.rrrr\")),Oznámení!B34)","v":"1.1.2021 - 31.12.2021"}]
{"$rows_left_out":78}
{"sheet":"List č. 11","index":14,"n_rows":83,"n_cols":2,"rows_kept":83,"cut":false,"hidden":false,"merged":[[0,0,0,2],[2,1,2,2],[15,0,15,2],[24,0,24,2],[33,0,33,2],[42,0,42,2],[4,1,4,2],[8,0,9,2],[6,1,6,2],[7,1,7,2],[5,1,5,2]]}
[{"$f":"IF(Data!W2=1,\"Prazdný list netiskněte. Vyplňte pouze v případě, že počet políček v Oznámení nebude dostatečný.\",\"Vytiskněte a vyplňte pouze v případě, že počet políček v Oznámení nebude dostatečný\")","v":"Prazdný list netiskněte. Vyplňte pouze v případě, že počet políček v Oznámení nebude dostatečný."}]
[]
["OZ 3 - NS/12/2021","List č. 11 - Nesplacené závazky"]
[null,"List číslo"]
["Jméno, příjmení, datum narození",{"$f":"IF(Oznámení!B8=\"\",\"\",CONCATENATE(Oznámení!B8,\", nar. \",TEXT(Oznámení!B9,\"dd.mm.rrrr\")))","v":""}]
["Organizace",{"$f":"IF(Oznámení!B22=\"\",\"\",Oznámení!B22)","v":""}]
["Typ oznámení",{"$f":"IF(Data!W2=1,\"Průběžné oznámení; řádné\",IF(Data!W2=2,\"Průběžné oznámení; doplnění\",IF(Data!W2=0,\"Průběžné oznámení;       ⃝   řádné              ⃝   doplnění\")))","v":"Průběžné oznámení; řádné"}]
["Období od - do",{"$f":"IF(Oznámení!B34=\"\",CONCATENATE(TEXT(Oznámení!B32,\"dd.mm.rrrr\")),Oznámení!B34)","v":"1.1.2021 - 31.12.2021"}]
{"$rows_left_out":75}